{"text_format":"1","workbook":"xlsx","n_sheets":3,"sheets":["OVERAL SCORE","Buscar","Base"],"not_rendered":{"charts":0,"images":3,"macros":1,"external_links":0,"defined_names":6,"comments":0,"pivot_tables":0},"unopened":[],"bounds":{"document_bytes":16777216,"sheet_cells":100000,"rows_first":2000,"rows_last":500,"rows_between":2000,"halvings":0,"cell_chars":16384,"cell_head_chars":4096},"cells_cut":0,"cells_raw":0,"read":"whole","date_system":"1900"}

{"sheet":"OVERAL SCORE","index":0,"n_rows":8,"n_cols":22,"rows_kept":8,"cut":false,"hidden":true,"merged":[]}
[]
[]
[]
[]
[]
[]
[]
[null,null,null,null,null,null,null,null,null,null,null,null,null,null,null,null,null,null,null,null,null,"CILCE"]

{"sheet":"Buscar","index":1,"n_rows":18,"n_cols":7,"rows_kept":18,"cut":false,"hidden":false,"merged":[[0,1,2,8]]}
[null,"PRUEBAS DE CARACTERIZACIÓN DOCENTES Y ADMINISTRATIVOS\nUNIVERSIDAD SANTO TOMÁS SECCIONAL TUNJA\n2022-2"]
[]
[]
[null,null,null,1001]
[]
[null,null,"ESCRIBE TU CC"]
[]
[]
[]
[null,null,"NOMBRE COMPLETO",{"$f":"_xlfn.IFNA(VLOOKUP(D6,Base!A:J,2,0),\"-\")","v":"-"}]
[]
[null,null,"CARGO",{"$f":"_xlfn.IFNA(VLOOKUP(D6,Base!A:J,3,0),\"-\")","v":"-"},null,"RESULTADO",{"$f":"_xlfn.IFNA(VLOOKUP(D6,Base!A:J,7,0),\"-\")","v":"-"}]
[]
[null,null,"ÁREA",{"$f":"_xlfn.IFNA(VLOOKUP(D6,Base!A:J,4,0),\"-\")","v":"-"},null,"NIVEL ACTUAL",{"$f":"_xlfn.IFNA(VLOOKUP(D6,Base!A:J,8,0),\"-\")","v":"-"}]
[]
[null,null,"CITACIÓN",{"$f":"_xlfn.IFNA(VLOOKUP(D6,Base!A:J,5,0),\"-\")","v":"-"},null,"AVANCE",{"$f":"_xlfn.IFNA(VLOOKUP(D6,Base!A:J,9,0),\"-\")","v":"-"}]
[]
[null,null,"PRUEBA ANTERIOR",{"$f":"_xlfn.IFNA(VLOOKUP(D6,Base!A:J,6,0),\"-\")","v":"-"},null,"CERT. INTERNAL.",{"$f":"_xlfn.IFNA(VLOOKUP(D6,Base!A:J,10,0),\"-\")","v":"-"}]

{"sheet":"Base","index":2,"n_rows":568,"n_cols":10,"rows_kept":568,"cut":false,"hidden":true,"merged":[]}
["ID","NOMBRE COMPLETO","CARGO","ÁREA","CITACIÓN","1ST TEST","SCORE","2ND TEST","\"IMPROVEMENT\"","CERTIFICACIÓN"]
[33376210,"YENIFER MARCELA AVENDANO BERNAL","DOCENTE","FACULTAD CULTURA FIS DEPO RECR","OK","A2",33,"A2",{"$f":"+IF(F2=\"NP\",\"NA\",IF(F2=H2,\"SAME LEVEL\",0))","v":"SAME LEVEL"},"NA"]
[40040157,"LYDA FABIOLA VALLEJO CASTILLO","DOCENTE","FACULTAD CULTURA FIS DEPO RECR","OK","A2",20,"A1","LEVEL DOWN","NA"]
[40042802,"YOLIMA RAMIREZ PERALTA","AUXILIAR","FACULTAD CULTURA FIS DEPO RECR","OK","NP",21,"A1",{"$f":"+IF(F4=\"NP\",\"NA\",IF(F4=H4,\"SAME LEVEL\",0))","v":"NA"},"NA"]
[79943045,"FERNANDO ALBERTO BOHORQUEZ CAMPOS","DOCENTE","FACULTAD CULTURA FIS DEPO RECR","OK","B1",63,"B1","SAME LEVEL","Certificado B2 - APTIS 2021"]
[79975067,"OSCAR EDUARDO MUNOZ PULIDO","DECANO (A)","FACULTAD CULTURA FIS DEPO RECR","OK","NP","NP","NP","NA","NA"]
[80726871,"WILLIAM LEONARDO OCHOA MORENO","DOCENTE","FACULTAD CULTURA FIS DEPO RECR","OK","A1",20,"A1","SAME LEVEL","NA"]
[91495625,"HAROLD RODRIGO ORTEGA MOGOLLON","DOCENTE","FACULTAD CULTURA FIS DEPO RECR","OK","NP",49,"A2+","NA","NA"]
[91532816,"GUSTAVO ANDRES LARA OVIEDO","DOCENTE","FACULTAD CULTURA FIS DEPO RECR","OK","NP",27,"A2","NA","NA"]
[1015419293,"SONIA VIVIANA ANZOLA CRUZ","DOCENTE","FACULTAD CULTURA FIS DEPO RECR","OK","A2",40,"A2","SAME LEVEL","NA"]
[1023932570,"LUIS ANDRES TELLEZ TINJACA","DOCENTE","FACULTAD CULTURA FIS DEPO RECR","OK","A2",37,"A2","SAME LEVEL","NA"]
[1049658790,"MIGUEL ANGEL SILVA CORPUS","PROFESIONAL SOPORTE","FACULTAD CULTURA FIS DEPO RECR","OK","NP",21,"A1","NA","NA"]
[1053326321,"OSCAR LEONARDO PENA ROJAS","DOCENTE","FACULTAD CULTURA FIS DEPO RECR","OK","A2",31,"A2","SAME LEVEL","NA"]
[1054679877,"LEYDY VIVIANA ACOSTA FAJARDO","DOCENTE","FACULTAD CULTURA FIS DEPO RECR","OK","A2",37,"A2","SAME LEVEL","NA"]
[7178288,"NESTOR MANUEL ABRIL ESTUPINAN","DOCENTE","FACULTAD CULTURA FIS DEPO RECR","OK","A2",33,"A2","SAME LEVEL","NA"]
[6766032,"OSCAR AUGUSTO SUAREZ GIL","DOCENTE","FACULTAD CULTURA FIS DEPO RECR","OK","NP",23,"A1","NA","NA"]
[6762891,"PUBLIO SUAREZ SOTOMONTE","DOCENTE","DPTO DE CIENCIAS BASICAS","OK","A1",23,"A1",{"$f":"+IF(F17=\"NP\",\"NA\",IF(F17=H17,\"SAME LEVEL\",0))","v":"SAME LEVEL"},"NA"]
[6763314,"JOSE FRANCISCO LEGUIZAMON ROMERO","DOCENTE","DPTO DE CIENCIAS BASICAS","OK","A2",31,"A2",{"$f":"+IF(F18=\"NP\",\"NA\",IF(F18=H18,\"SAME LEVEL\",0))","v":"SAME LEVEL"},"NA"]
[7180864,"JOSE ALBERTO CARRILLO CHAPARRO","DOCENTE","DPTO DE CIENCIAS BASICAS","OK","A1",17,"A1",{"$f":"+IF(F19=\"NP\",\"NA\",IF(F19=H19,\"SAME LEVEL\",0))","v":"SAME LEVEL"},"NA"]
[7188210,"JULIAN DAVID SEGURA PENA","DOCENTE","DPTO DE CIENCIAS BASICAS","OK","A2",23,"A1","LEVEL DOWN","NA"]
[7363246,"HELVER RINCON MARQUEZ","DOCENTE","DPTO DE CIENCIAS BASICAS","OK","A2",40,"A2",{"$f":"+IF(F21=\"NP\",\"NA\",IF(F21=H21,\"SAME LEVEL\",0))","v":"SAME LEVEL"},"NA"]
[23438690,"NURY YOLANDA SUAREZ AVILA","DOCENTE","DPTO DE CIENCIAS BASICAS","OK","A2",26,"A2","SAME LEVEL","NA"]
[33365892,"ELSA LILIANA GUZMAN RINCON","DOCENTE","DPTO DE CIENCIAS BASICAS","OK","A2",36,"A2","SAME LEVEL","NA"]
[33369048,"MAGDA PATRICIA ROJAS SARMIENTO","DOCENTE","DPTO DE CIENCIAS BASICAS","OK","NP",31,"A2","NA","NA"]
[40025358,"CLAUDIA ROCIO URIBE SUAREZ","DOCENTE","DPTO DE CIENCIAS BASICAS","OK","A1",21,"A1","SAME LEVEL","NA"]
[40040976,"SANDRA BIVIANA GONZALEZ FIAGA","DOCENTE","DPTO DE CIENCIAS BASICAS","OK","A1",20,"A1","SAME LEVEL","NA"]
[40043862,"SULLY SEGURA PENA","DOCENTE","DPTO DE CIENCIAS BASICAS","OK","A1",30,"A2","LEVEL UP","NA"]
[40049430,"LUZ ADRIANA PABON CACHOPE","DOCENTE","DPTO DE CIENCIAS BASICAS","OK","A2",34,"A2",{"$f":"+IF(F28=\"NP\",\"NA\",IF(F28=H28,\"SAME LEVEL\",0))","v":"SAME LEVEL"},"NA"]
[52219858,"ADRIANA MARCELA VALERO POSADA","DOCENTE","DPTO DE CIENCIAS BASICAS","OK","A1",33,"A2","LEVEL UP","NA"]
[74181931,"RODRIGO ALONSO CASTRO NINO","DOCENTE","DPTO DE CIENCIAS BASICAS","OK","A2",44,"A2+","LEVEL UP","NA"]
[74433202,"JOSE VICENTE SAMACA RAMIREZ","DOCENTE","DPTO DE CIENCIAS BASICAS","OK","A1",33,"A2","LEVEL UP","NA"]
[1072655319,"HEIDDY PAOLA QUIROZ GAITAN","DOCENTE","DPTO DE CIENCIAS BASICAS","OK","NP",59,"A2+",{"$f":"+IF(F32=\"NP\",\"NA\",IF(F32=H32,\"SAME LEVEL\",0))","v":"NA"},"NA"]
[1049616358,"LEIDY JOHANA SUAREZ GOMEZ","DOCENTE","DPTO DE CIENCIAS BASICAS","OK","A1",23,"A1",{"$f":"+IF(F33=\"NP\",\"NA\",IF(F33=H33,\"SAME LEVEL\",0))","v":"SAME LEVEL"},"NA"]
[1049618734,"BRIGID HIOMARA PACHECO GARCIA","DIRECTOR (A)","DPTO DE CIENCIAS BASICAS","OK","A1",27,"A2","LEVEL UP","NA"]
[1049618916,"TATHIANA YESENIA COY MONDRAGON","DOCENTE","DPTO DE CIENCIAS BASICAS","OK","A1",36,"A2","LEVEL UP","NA"]
[1049628697,"ERIKA ALEJANDRA SUAREZ DIAZ","DOCENTE","DPTO DE CIENCIAS BASICAS","OK","A2",20,"A1","LEVEL DOWN","NA"]
[1049630934,"FABIAN HERNANDO ANAYA SIERRA","DOCENTE","DPTO DE CIENCIAS BASICAS","OK","A2",33,"A2",{"$f":"+IF(F37=\"NP\",\"NA\",IF(F37=H37,\"SAME LEVEL\",0))","v":"SAME LEVEL"},"NA"]
[1052386426,"JORGE LEONARDO PITA OJEDA","DOCENTE","DPTO DE CIENCIAS BASICAS","OK","A2",43,"A2",{"$f":"+IF(F38=\"NP\",\"NA\",IF(F38=H38,\"SAME LEVEL\",0))","v":"SAME LEVEL"},"NA"]
[1057573883,"JULIAN STEVEN GUTIERREZ SAAVEDRA","DOCENTE","DPTO DE CIENCIAS BASICAS","OK","NP",53,"A2+",{"$f":"+IF(F39=\"NP\",\"NA\",IF(F39=H39,\"SAME LEVEL\",0))","v":"NA"},"NA"]
[40030913,"FRANCY JEANNETH PEREZ ACUNA","AUXILIAR","DPTO DE CIENCIAS BASICAS","OK","A1",19,"A1",{"$f":"+IF(F40=\"NP\",\"NA\",IF(F40=H40,\"SAME LEVEL\",0))","v":"SAME LEVEL"},"NA"]
[46452729,"MARTHA ELIZABETH BENAVIDES ROZO","DOCENTE","DPTO DE CIENCIAS BASICAS","OK","A1",24,"A1",{"$f":"+IF(F41=\"NP\",\"NA\",IF(F41=H41,\"SAME LEVEL\",0))","v":"SAME LEVEL"},"NA"]
[46453485,"EMILSE YAMILE BECERRA GUECHA","DOCENTE","DPTO DE CIENCIAS BASICAS","OK","B1+",27,"A2","LEVEL DOWN","NA"]
[1049611991,"ELIANA MARITZA TULCAN MEJIA","DOCENTE","DPTO DE CIENCIAS BASICAS","OK","A2",51,"A2+","LEVEL UP","NA"]
[40034680,"ZANDRA OMAIRA SILVA FONSECA","DOCENTE","DPTO DE CIENCIAS BASICAS","OK","A2",51,"A2+","LEVEL UP","NA"]
[4280171,"ALFONSO CAMARGO MUNOZ","DOCENTE","DEPARTAMENTO DE HUMANIDADES","OK","A2",29,"A2",{"$f":"+IF(F45=\"NP\",\"NA\",IF(F45=H45,\"SAME LEVEL\",0))","v":"SAME LEVEL"},"NA"]
[7161675,"ANUAR ALUD SORA","DOCENTE","DEPARTAMENTO DE HUMANIDADES","OK","A2",26,"A2",{"$f":"+IF(F46=\"NP\",\"NA\",IF(F46=H46,\"SAME LEVEL\",0))","v":"SAME LEVEL"},"NA"]
[7164361,"JOSE OVIDIO NOCUA ACUNA","DOCENTE","DEPARTAMENTO DE HUMANIDADES","OK","A2",23,"A1","LEVEL DOWN","NA"]
[7176089,"HERNAN JAVIER PINZON MANRIQUE","DOCENTE","DEPARTAMENTO DE HUMANIDADES","OK","A2",51,"A2+","LEVEL UP","NA"]
[7180283,"MILTON ADOLFO BAUTISTA ROA","DOCENTE","DEPARTAMENTO DE HUMANIDADES","OK","A2+",39,"A2","LEVEL DOWN","NA"]
[7228602,"JOSE ALBERTO MEDINA LOZANO","DOCENTE","DEPARTAMENTO DE HUMANIDADES","OK","NP",63,"B1",{"$f":"+IF(F50=\"NP\",\"NA\",IF(F50=H50,\"SAME LEVEL\",0))","v":"NA"},"NA"]
[7314804,"MILTON JAVIER PIRAZAN RODRIGUEZ","DOCENTE","DEPARTAMENTO DE HUMANIDADES","OK","A2+",21,"A1","LEVEL DOWN","NA"]
[40022508,"MYRIAM MARITZA NINO FORERO","DOCENTE","DEPARTAMENTO DE HUMANIDADES","OK","A1",9,"A1",{"$f":"+IF(F52=\"NP\",\"NA\",IF(F52=H52,\"SAME LEVEL\",0))","v":"SAME LEVEL"},"NA"]
[40024522,"ANA HERLINDA VARGAS LEON","AUXILIAR","DEPARTAMENTO DE HUMANIDADES","OK","A1","NP","NP","NA","NA"]
[46382013,"MARIA TERESA GOMEZ RAMIREZ","DOCENTE","DEPARTAMENTO DE HUMANIDADES","OK","A2",40,"A2",{"$f":"+IF(F54=\"NP\",\"NA\",IF(F54=H54,\"SAME LEVEL\",0))","v":"SAME LEVEL"},"NA"]
[46386084,"ANDREA DEL PILAR PEREZ RAIGOSO","DOCENTE","DEPARTAMENTO DE HUMANIDADES","OK","A2+",27,"A2","LEVEL DOWN","NA"]
[46454283,"DIANA DERLY HURTADO PENA","DOCENTE","DEPARTAMENTO DE HUMANIDADES","OK","A2",37,"A2",{"$f":"+IF(F56=\"NP\",\"NA\",IF(F56=H56,\"SAME LEVEL\",0))","v":"SAME LEVEL"},"NA"]
[52717065,"LYDA CONSTANZA PULIDO MUNOZ","DOCENTE","DEPARTAMENTO DE HUMANIDADES","OK","A2+",51,"A2+","SAME LEVEL","NA"]
[74377604,"GERARDO CARDOZO RINCON","DOCENTE","DEPARTAMENTO DE HUMANIDADES","OK","B1",61,"B1","SAME LEVEL","NA"]
[74379615,"EDGAR TAMARA PUERTO","DOCENTE","DEPARTAMENTO DE HUMANIDADES","OK","A2",27,"A2","SAME LEVEL","NA"]
[75078612,"ALEXANDER ANTONIO PUERTA PINEDA","DOCENTE","DEPARTAMENTO DE HUMANIDADES","OK","A2",26,"A2","SAME LEVEL","NA"]
[1020760944,"CARLOS ANDRES TORRALBA CANON","DOCENTE","DEPARTAMENTO DE HUMANIDADES","OK","A2+",57,"A2+","SAME LEVEL","NA"]
[1049604835,"DIEGO EDGARDO ROJAS ESCOBAR","DIRECTOR (A)","DEPARTAMENTO DE HUMANIDADES","OK","A1",24,"A1","SAME LEVEL","NA"]
[1049604935,"JONNATHAN ABDUL RINCON DIAZ","DOCENTE","DEPARTAMENTO DE HUMANIDADES","OK","A1",26,"A2","LEVEL UP","NA"]
[1049609922,"RAFAEL RICARDO BOHORQUEZ AUNTA","DOCENTE","DEPARTAMENTO DE HUMANIDADES","OK","A2+",46,"A2+",{"$f":"+IF(F64=\"NP\",\"NA\",IF(F64=H64,\"SAME LEVEL\",0))","v":"SAME LEVEL"},"NA"]
[1053327936,"DAVID SAENZ GUERRERO","DOCENTE","DEPARTAMENTO DE HUMANIDADES","OK","NP",89,"B2",{"$f":"+IF(F65=\"NP\",\"NA\",IF(F65=H65,\"SAME LEVEL\",0))","v":"NA"},"NA"]
[1127207081,"DANIEL MAURICIO MOYA URUENA","DOCENTE","DEPARTAMENTO DE HUMANIDADES","OK","B2+",97,"C1","LEVEL UP","NA"]
[51872394,"CLAUDIA LILIANA RAMOS QUINTERO","DOCENTE","DEPARTAMENTO DE HUMANIDADES","OK","NP",41,"A2",{"$f":"+IF(F67=\"NP\",\"NA\",IF(F67=H67,\"SAME LEVEL\",0))","v":"NA"},"NA"]
[3228676,"SANTIAGO MARIA BORDAMALO ECHEVERRI","DOCENTE","DEPARTAMENTO DE HUMANIDADES","OK","A2",39,"A2",{"$f":"+IF(F68=\"NP\",\"NA\",IF(F68=H68,\"SAME LEVEL\",0))","v":"SAME LEVEL"},"NA"]
[6775513,"JOSE EDUARDO PARDO VALENZUELA","DOCENTE","DEPARTAMENTO DE HUMANIDADES","OK","A1",19,"A1",{"$f":"+IF(F69=\"NP\",\"NA\",IF(F69=H69,\"SAME LEVEL\",0))","v":"SAME LEVEL"},"NA"]
[1070592370,"DIEGO FERNANDO BARRIOS ANDRADE","DOCENTE","DEPARTAMENTO DE HUMANIDADES","OK","B1",81,"B1+","LEVEL UP","NA"]
[40038073,"CLAUDIA YADIRA QUINTERO CASTILLO","AUXILIAR","CAFETERIA","OK","NP",20,"A1",{"$f":"+IF(F71=\"NP\",\"NA\",IF(F71=H71,\"SAME LEVEL\",0))","v":"NA"},"NA"]
[40042618,"LUZ MIREYA CARDENAS MARTINEZ","AUXILIAR","CAFETERIA","OK","NP",16,"A1",{"$f":"+IF(F72=\"NP\",\"NA\",IF(F72=H72,\"SAME LEVEL\",0))","v":"NA"},"NA"]
[1019011785,"OFILIA RUIZ MOLINA","AUXILIAR","CAFETERIA","OK","NP",23,"A1",{"$f":"+IF(F73=\"NP\",\"NA\",IF(F73=H73,\"SAME LEVEL\",0))","v":"NA"},"NA"]
[1049625268,"ERIKA YERALDIN NINO MENDOZA","AUXILIAR","CAFETERIA","OK","NP",26,"A2",{"$f":"+IF(F74=\"NP\",\"NA\",IF(F74=H74,\"SAME LEVEL\",0))","v":"NA"},"NA"]
[7188110,"OSCAR JAVIER BARAHONA ROMERO","PROFESIONAL SOPORTE","CAMPUS VIRTUAL","OK","NP",21,"A1",{"$f":"+IF(F75=\"NP\",\"NA\",IF(F75=H75,\"SAME LEVEL\",0))","v":"NA"},"NA"]
[33368288,"LILIANA MENDIVELSO MELO","DIRECTOR (A) ACADEMICO (A)","CAMPUS VIRTUAL","OK","A2",23,"A1","LEVEL DOWN","NA"]
[33377522,"LYDA ALEXANDRA ARCOS AVILA","PROFESIONAL SOPORTE","CAMPUS VIRTUAL","OK","A1",24,"A1",{"$f":"+IF(F77=\"NP\",\"NA\",IF(F77=H77,\"SAME LEVEL\",0))","v":"SAME LEVEL"},"NA"]
[1002327894,"ANGELA PATRICIA JEREZ PAEZ","PROFESIONAL SOPORTE","CAMPUS VIRTUAL","OK","A2+",23,"A1","LEVEL DOWN","NA"]
[1097666178,"BAYRON SAMUEL MARIN ORTIZ","PROFESIONAL SOPORTE","CAMPUS VIRTUAL","OK","NP",19,"A1",{"$f":"+IF(F79=\"NP\",\"NA\",IF(F79=H79,\"SAME LEVEL\",0))","v":"NA"},"NA"]
[1056956709,"DIEGO ALEJANDRO VELA BELTRAN","PROFESIONAL SOPORTE","CAMPUS VIRTUAL","OK","A2+",46,"A2+",{"$f":"+IF(F80=\"NP\",\"NA\",IF(F80=H80,\"SAME LEVEL\",0))","v":"SAME LEVEL"},"NA"]
[33377742,"ERIKA MARCELA MONROY HERNANDEZ","PROFESIONAL SOPORTE","CONSULTORIO JURIDICO","OK","A2",26,"A2",{"$f":"+IF(F81=\"NP\",\"NA\",IF(F81=H81,\"SAME LEVEL\",0))","v":"SAME LEVEL"},"NA"]
[40029725,"MARIA MERCEDES RIANO ROA","AUXILIAR","CONSULTORIO JURIDICO","OK","A2",26,"A2",{"$f":"+IF(F82=\"NP\",\"NA\",IF(F82=H82,\"SAME LEVEL\",0))","v":"SAME LEVEL"},"NA"]
[75096094,"RUBEN DARIO SERNA SALAZAR","DIRECTOR (A)","CONSULTORIO JURIDICO","OK","A1","NP","NP","NA","NA"]
[1002461582,"MAGDA CONSUELO CUESTA LOPEZ","MONITOR","CONSULTORIO JURIDICO","OK","NP",36,"A2",{"$f":"+IF(F84=\"NP\",\"NA\",IF(F84=H84,\"SAME LEVEL\",0))","v":"NA"},"NA"]
[1002555485,"JUANITA MARIA RODRIGUEZ CENTENO","MONITOR","CONSULTORIO JURIDICO","OK","NP",37,"A2","NA","NA"]
[1010013667,"CRISTIAN DAVID PACHECO ROJAS","MONITOR","CONSULTORIO JURIDICO","OK","NP",27,"A2","NA","NA"]
[1049647154,"ADRIANA MARIA VALCARCEL MONROY","PROFESIONAL SOPORTE","CONSULTORIO JURIDICO","OK","NP",30,"A2","NA","NA"]
[1049654444,"LAURA MANUELA LESMES DUITAMA","AUXILIAR","CONSULTORIO JURIDICO","OK","NP",70,"B1","NA","NA"]
[1049658295,"PAULA ANDREA JIMENEZ NOCUA","MONITOR","CONSULTORIO JURIDICO","OK","NP","NP","NP","NA","NA"]
[1052401268,"DAYLIN ALEJANDRA SANCHEZ JAIMES","AUXILIAR","CONSULTORIO JURIDICO","OK","NP",23,"A1","NA","NA"]
[1053611827,"LINA MARCELA CAMARGO MARTINEZ","COORDINADOR (A)","CONSULTORIO JURIDICO","OK","A2",31,"A2","SAME LEVEL","NA"]
[6764869,"PEDRO GUILLERMO PACHON EUGENIO","AUXILIAR","CRAI  USTA","OK","A2",31,"A2","SAME LEVEL","NA"]
[7178155,"SAMUEL RICARDO CUERVO MORA","PROFESIONAL SOPORTE","CRAI  USTA","OK","NP",26,"A2","NA","NA"]
[40035160,"LUZ MARINA DUENAS CONTRERAS","PROFESIONAL SOPORTE","CRAI  USTA","OK","A1",21,"A1","SAME LEVEL","NA"]
[40044699,"SANDRA ROSMARY CARDENAS RUIZ","PROFESIONAL SOPORTE","CRAI  USTA","OK","NP",16,"A1","NA","NA"]
[52496788,"DELFINA CUBILLOS CAMACHO","AUXILIAR","CRAI  USTA","OK","A1",31,"A2","LEVEL UP","NA"]
[1049632796,"KARENTH JULIANA BOHADA SALAZAR","AUXILIAR","CRAI  USTA","OK","NP",23,"A1",{"$f":"+IF(F97=\"NP\",\"NA\",IF(F97=H97,\"SAME LEVEL\",0))","v":"NA"},"NA"]
[1071172038,"JULIAN DAVID CRUZ PRIETO","AUXILIAR","CRAI  USTA","OK","NP",19,"A1","NA","NA"]
[72286042,"JUAN CARLOS CANOLES VASQUES","DIRECTOR (A)","CRAI  USTA","OK","NP",36,"A2","NA","NA"]
[1049626976,"LORENA STEPHANNY ABRIL RODRIGUEZ","DIRECTOR (A)","DEPARTAMENTO DE ADMISIONES","OK","NP",31,"A2","NA","NA"]
[1049646633,"JONATHAN DUBAN CARDENAS AYALA","AUXILIAR","DEPARTAMENTO DE ADMISIONES","OK","NP",21,"A1","NA","NA"]
[1007420966,"ANGIE CAROLINA BOHORQUEZ GOMEZ","AUXILIAR","DEPARTAMENTO DE ADMISIONES","OK","NP",20,"A1","NA","NA"]
[1049645329,"MARIA PAULA GUIO LOZANO","PROFESIONAL SOPORTE","DEPARTAMENTO DE ADMISIONES","OK","NP","NP","A2","NA","NA"]
[1049638813,"DANIELA ESPERANZA JIMENEZ CORONADO","AUXILIAR","DEPARTAMENTO DE ADMISIONES","OK","A2","NP","NP","NA","NA"]
[7177089,"BORIS ORLANDO HERNANDEZ BERNAL","DIRECTOR (A)","DEPARTAMENTO DE COMUNICACIONES","OK","NP","NP","NP",{"$f":"+IF(F105=\"NP\",\"NA\",IF(F105=H105,\"SAME LEVEL\",0))","v":"NA"},"NA"]
[7180903,"IVAN DARIO GONZALEZ RUBIO","COORDINADOR (A)","DEPARTAMENTO DE COMUNICACIONES","OK","NP",33,"A2",{"$f":"+IF(F106=\"NP\",\"NA\",IF(F106=H106,\"SAME LEVEL\",0))","v":"NA"},"NA"]
[1002365558,"JUAN PABLO AMAYA ACEVEDO","AUXILIAR","DEPARTAMENTO DE COMUNICACIONES","OK","A1",33,"A2","LEVEL UP","NA"]
[1015450182,"DANIEL JOSE GUERRERO CAMACHO","PROFESIONAL SOPORTE","DEPARTAMENTO DE COMUNICACIONES","OK","A2+",39,"A2","LEVEL DOWN","NA"]
[1049602627,"YULY LORENA ORDUZ VALBUENA","PROFESIONAL SOPORTE","DEPARTAMENTO DE COMUNICACIONES","OK","A2",51,"A2+","LEVEL UP","NA"]
[1049628587,"LINA MARIA ORTIZ MOLINA","PROFESIONAL SOPORTE","DEPARTAMENTO DE COMUNICACIONES","OK","A2",39,"A2",{"$f":"+IF(F110=\"NP\",\"NA\",IF(F110=H110,\"SAME LEVEL\",0))","v":"SAME LEVEL"},"NA"]
[1049633174,"FABIAN CAMILO PULIDO GARAVITO","PROFESIONAL SOPORTE","DEPARTAMENTO DE COMUNICACIONES","OK","NP","NP","NP",{"$f":"+IF(F111=\"NP\",\"NA\",IF(F111=H111,\"SAME LEVEL\",0))","v":"NA"},"NA"]
[1049655290,"IVAN ARLEY GONZALEZ URICOECHEA","AUXILIAR","DEPARTAMENTO DE COMUNICACIONES","OK","NP",41,"A2",{"$f":"+IF(F112=\"NP\",\"NA\",IF(F112=H112,\"SAME LEVEL\",0))","v":"NA"},"NA"]
[1049656621,"ERIKA JASMIN AMAYA ACEVEDO","AUXILIAR","DEPARTAMENTO DE COMUNICACIONES","OK","A2",24,"A1","LEVEL DOWN","NA"]
[1052396739,"WILLIAM FERNANDO ABRIL AVELLA","PROFESIONAL SOPORTE","DEPARTAMENTO DE COMUNICACIONES","OK","A2",49,"A2+","LEVEL UP","NA"]
[1053867530,"JAZBLADY RUIZ CIFUENTES","PROFESIONAL SOPORTE","DEPARTAMENTO DE COMUNICACIONES","OK","NP",60,"A2+",{"$f":"+IF(F115=\"NP\",\"NA\",IF(F115=H115,\"SAME LEVEL\",0))","v":"NA"},"NA"]
[1056030143,"MARTHA LILIANA SUAREZ CRUCES","PROFESIONAL SOPORTE","DEPARTAMENTO DE COMUNICACIONES","OK","NP",24,"A1",{"$f":"+IF(F116=\"NP\",\"NA\",IF(F116=H116,\"SAME LEVEL\",0))","v":"NA"},"NA"]
[1056931080,"MIGUEL ANGEL CUENCA ALVAREZ","AUXILIAR","DEPARTAMENTO DE COMUNICACIONES","OK","A2",49,"A2+","LEVEL UP","NA"]
[1057591474,"JESSICA LAURETH ROMERO JIMENEZ","AUXILIAR","DEPARTAMENTO DE COMUNICACIONES","OK","NP",24,"A1",{"$f":"+IF(F118=\"NP\",\"NA\",IF(F118=H118,\"SAME LEVEL\",0))","v":"NA"},"NA"]
[1083018568,"JESUS DAVID PINILLA VEGA","PROFESIONAL SOPORTE","DEPARTAMENTO DE COMUNICACIONES","OK","B1",77,"B1+","LEVEL UP","NA"]
[1090433613,"ANDRES FELIPE RAMIREZ LLANES","PROFESIONAL SOPORTE","DEPARTAMENTO DE COMUNICACIONES","OK","A1",21,"A1",{"$f":"+IF(F120=\"NP\",\"NA\",IF(F120=H120,\"SAME LEVEL\",0))","v":"SAME LEVEL"},"NA"]
{"$rows_left_out":448}